FailedConsole Output

Started by an SCM change
Building in workspace /var/lib/jenkins/workspace/redux
 > git rev-parse --is-inside-work-tree # timeout=10
Fetching changes from the remote Git repository
 > git config remote.origin.url https://github.com/Quiddity-Modding/Redux.git # timeout=10
Fetching upstream changes from https://github.com/Quiddity-Modding/Redux.git
 > git --version # timeout=10
 > git fetch --tags --progress https://github.com/Quiddity-Modding/Redux.git +refs/heads/*:refs/remotes/origin/*
Seen branch in repository origin/master
Seen 1 remote branch
Checking out Revision b3fbff977cd49724450e9a106998006a93f3500d (origin/master)
 > git config core.sparsecheckout # timeout=10
 > git checkout -f b3fbff977cd49724450e9a106998006a93f3500d
 > git rev-list bcdea6a0ea87f51d16ec99b0f3070bb70c0c3a57 # timeout=10
[redux] $ /bin/sh -xe /tmp/hudson8128840015269727569.sh
+ rm -rf build/libs
[Gradle] - Launching build.
[redux] $ /var/lib/jenkins/workspace/redux/gradlew -s -Plocal_maven=/var/www/dvs1/files/maven reobf uploadArchives
****************************
 Powered By MCP:             
 http://mcp.ocean-labs.de/   
 Searge, ProfMobius, Fesh0r, 
 R4wk, ZeuX, IngisKahn, bspkrs
 MCP Data version : snapshot_nodoc_20141130
****************************
:extractMcpData UP-TO-DATE
:getVersionJson
:extractUserDev UP-TO-DATE
:genSrgs SKIPPED
:downloadClient SKIPPED
:downloadServer SKIPPED
:mergeJars SKIPPED
:applyBinPatches SKIPPED
:downloadMcpTools SKIPPED
:deobfBinJar SKIPPED
:compileApiJava UP-TO-DATE
:processApiResources UP-TO-DATE
:apiClasses UP-TO-DATE
:sourceMainJava
:compileJavawarning: [options] bootstrap class path not set in conjunction with -source 1.6
/var/lib/jenkins/workspace/redux/build/sources/java/mods/quiddity/redux/JavaScript/NashornEngine.java:3: error: package jdk.nashorn.api.scripting does not exist
import jdk.nashorn.api.scripting.ClassFilter;
                                ^
/var/lib/jenkins/workspace/redux/build/sources/java/mods/quiddity/redux/JavaScript/NashornEngine.java:4: error: package jdk.nashorn.api.scripting does not exist
import jdk.nashorn.api.scripting.NashornScriptEngine;
                                ^
/var/lib/jenkins/workspace/redux/build/sources/java/mods/quiddity/redux/JavaScript/NashornEngine.java:5: error: package jdk.nashorn.api.scripting does not exist
import jdk.nashorn.api.scripting.NashornScriptEngineFactory;
                                ^
/var/lib/jenkins/workspace/redux/build/sources/java/mods/quiddity/redux/JavaScript/NashornEngine.java:10: error: cannot find symbol
    private NashornScriptEngine nashornScriptEngine;
            ^
  symbol:   class NashornScriptEngine
  location: class NashornEngine
/var/lib/jenkins/workspace/redux/build/sources/java/mods/quiddity/redux/JavaScript/NashornEngine.java:68: error: cannot find symbol
    class ReduxClassFilter implements ClassFilter {
                                      ^
  symbol:   class ClassFilter
  location: class NashornEngine
/var/lib/jenkins/workspace/redux/build/sources/java/mods/quiddity/redux/JavaScript/NashornEngine.java:17: error: cannot find symbol
        ccl = (ccl == null ? NashornScriptEngineFactory.class.getClassLoader() : ccl);
                             ^
  symbol:   class NashornScriptEngineFactory
  location: class NashornEngine
/var/lib/jenkins/workspace/redux/build/sources/java/mods/quiddity/redux/JavaScript/NashornEngine.java:29: error: cannot find symbol
            nashornScriptEngine = (NashornScriptEngine) new NashornScriptEngineFactory().getScriptEngine("--no-java");
                                   ^
  symbol:   class NashornScriptEngine
  location: class NashornEngine
/var/lib/jenkins/workspace/redux/build/sources/java/mods/quiddity/redux/JavaScript/NashornEngine.java:29: error: cannot find symbol
            nashornScriptEngine = (NashornScriptEngine) new NashornScriptEngineFactory().getScriptEngine("--no-java");
                                                            ^
  symbol:   class NashornScriptEngineFactory
  location: class NashornEngine
/var/lib/jenkins/workspace/redux/build/sources/java/mods/quiddity/redux/JavaScript/NashornEngine.java:69: error: method does not override or implement a method from a supertype
        @Override
        ^
Note: /var/lib/jenkins/workspace/redux/build/sources/java/mods/quiddity/redux/json/model/Block.java uses unchecked or unsafe operations.
Note: Recompile with -Xlint:unchecked for details.
9 errors
1 warning
 FAILED

FAILURE: Build failed with an exception.

* What went wrong:
Execution failed for task ':compileJava'.
> Compilation failed; see the compiler error output for details.

* Try:
Run with --info or --debug option to get more log output.

* Exception is:
org.gradle.api.tasks.TaskExecutionException: Execution failed for task ':compileJava'.
	at org.gradle.api.internal.tasks.execution.ExecuteActionsTaskExecuter.executeActions(ExecuteActionsTaskExecuter.java:69)
	at org.gradle.api.internal.tasks.execution.ExecuteActionsTaskExecuter.execute(ExecuteActionsTaskExecuter.java:46)
	at org.gradle.api.internal.tasks.execution.PostExecutionAnalysisTaskExecuter.execute(PostExecutionAnalysisTaskExecuter.java:35)
	at org.gradle.api.internal.tasks.execution.SkipUpToDateTaskExecuter.execute(SkipUpToDateTaskExecuter.java:64)
	at org.gradle.api.internal.tasks.execution.ValidatingTaskExecuter.execute(ValidatingTaskExecuter.java:58)
	at org.gradle.api.internal.tasks.execution.SkipEmptySourceFilesTaskExecuter.execute(SkipEmptySourceFilesTaskExecuter.java:42)
	at org.gradle.api.internal.tasks.execution.SkipTaskWithNoActionsExecuter.execute(SkipTaskWithNoActionsExecuter.java:52)
	at org.gradle.api.internal.tasks.execution.SkipOnlyIfTaskExecuter.execute(SkipOnlyIfTaskExecuter.java:53)
	at org.gradle.api.internal.tasks.execution.ExecuteAtMostOnceTaskExecuter.execute(ExecuteAtMostOnceTaskExecuter.java:43)
	at org.gradle.api.internal.AbstractTask.executeWithoutThrowingTaskFailure(AbstractTask.java:296)
	at org.gradle.execution.taskgraph.AbstractTaskPlanExecutor$TaskExecutorWorker.executeTask(AbstractTaskPlanExecutor.java:79)
	at org.gradle.execution.taskgraph.AbstractTaskPlanExecutor$TaskExecutorWorker.processTask(AbstractTaskPlanExecutor.java:63)
	at org.gradle.execution.taskgraph.AbstractTaskPlanExecutor$TaskExecutorWorker.run(AbstractTaskPlanExecutor.java:51)
	at org.gradle.execution.taskgraph.DefaultTaskPlanExecutor.process(DefaultTaskPlanExecutor.java:23)
	at org.gradle.execution.taskgraph.DefaultTaskGraphExecuter.execute(DefaultTaskGraphExecuter.java:86)
	at org.gradle.execution.SelectedTaskExecutionAction.execute(SelectedTaskExecutionAction.java:29)
	at org.gradle.execution.DefaultBuildExecuter.execute(DefaultBuildExecuter.java:61)
	at org.gradle.execution.DefaultBuildExecuter.access$200(DefaultBuildExecuter.java:23)
	at org.gradle.execution.DefaultBuildExecuter$2.proceed(DefaultBuildExecuter.java:67)
	at org.gradle.execution.DryRunBuildExecutionAction.execute(DryRunBuildExecutionAction.java:32)
	at org.gradle.execution.DefaultBuildExecuter.execute(DefaultBuildExecuter.java:61)
	at org.gradle.execution.DefaultBuildExecuter.execute(DefaultBuildExecuter.java:54)
	at org.gradle.initialization.DefaultGradleLauncher.doBuildStages(DefaultGradleLauncher.java:148)
	at org.gradle.initialization.DefaultGradleLauncher.doBuild(DefaultGradleLauncher.java:105)
	at org.gradle.initialization.DefaultGradleLauncher.run(DefaultGradleLauncher.java:85)
	at org.gradle.launcher.exec.InProcessBuildActionExecuter$DefaultBuildController.run(InProcessBuildActionExecuter.java:81)
	at org.gradle.launcher.cli.ExecuteBuildAction.run(ExecuteBuildAction.java:33)
	at org.gradle.launcher.cli.ExecuteBuildAction.run(ExecuteBuildAction.java:24)
	at org.gradle.launcher.exec.InProcessBuildActionExecuter.execute(InProcessBuildActionExecuter.java:39)
	at org.gradle.launcher.exec.InProcessBuildActionExecuter.execute(InProcessBuildActionExecuter.java:29)
	at org.gradle.launcher.cli.RunBuildAction.run(RunBuildAction.java:50)
	at org.gradle.internal.Actions$RunnableActionAdapter.execute(Actions.java:171)
	at org.gradle.launcher.cli.CommandLineActionFactory$ParseAndBuildAction.execute(CommandLineActionFactory.java:237)
	at org.gradle.launcher.cli.CommandLineActionFactory$ParseAndBuildAction.execute(CommandLineActionFactory.java:210)
	at org.gradle.launcher.cli.JavaRuntimeValidationAction.execute(JavaRuntimeValidationAction.java:35)
	at org.gradle.launcher.cli.JavaRuntimeValidationAction.execute(JavaRuntimeValidationAction.java:24)
	at org.gradle.launcher.cli.CommandLineActionFactory$WithLogging.execute(CommandLineActionFactory.java:206)
	at org.gradle.launcher.cli.CommandLineActionFactory$WithLogging.execute(CommandLineActionFactory.java:169)
	at org.gradle.launcher.cli.ExceptionReportingAction.execute(ExceptionReportingAction.java:33)
	at org.gradle.launcher.cli.ExceptionReportingAction.execute(ExceptionReportingAction.java:22)
	at org.gradle.launcher.Main.doAction(Main.java:33)
	at org.gradle.launcher.bootstrap.EntryPoint.run(EntryPoint.java:45)
	at org.gradle.launcher.bootstrap.ProcessBootstrap.runNoExit(ProcessBootstrap.java:54)
	at org.gradle.launcher.bootstrap.ProcessBootstrap.run(ProcessBootstrap.java:35)
	at org.gradle.launcher.GradleMain.main(GradleMain.java:23)
	at org.gradle.wrapper.BootstrapMainStarter.start(BootstrapMainStarter.java:30)
	at org.gradle.wrapper.WrapperExecutor.execute(WrapperExecutor.java:127)
	at org.gradle.wrapper.GradleWrapperMain.main(GradleWrapperMain.java:56)
Caused by: org.gradle.api.internal.tasks.compile.CompilationFailedException: Compilation failed; see the compiler error output for details.
	at org.gradle.api.internal.tasks.compile.jdk6.Jdk6JavaCompiler.execute(Jdk6JavaCompiler.java:47)
	at org.gradle.api.internal.tasks.compile.jdk6.Jdk6JavaCompiler.execute(Jdk6JavaCompiler.java:38)
	at org.gradle.api.internal.tasks.compile.NormalizingJavaCompiler.delegateAndHandleErrors(NormalizingJavaCompiler.java:96)
	at org.gradle.api.internal.tasks.compile.NormalizingJavaCompiler.execute(NormalizingJavaCompiler.java:49)
	at org.gradle.api.internal.tasks.compile.NormalizingJavaCompiler.execute(NormalizingJavaCompiler.java:35)
	at org.gradle.api.internal.tasks.compile.DelegatingJavaCompiler.execute(DelegatingJavaCompiler.java:29)
	at org.gradle.api.internal.tasks.compile.DelegatingJavaCompiler.execute(DelegatingJavaCompiler.java:20)
	at org.gradle.api.internal.tasks.compile.CleaningJavaCompilerSupport.execute(CleaningJavaCompilerSupport.java:33)
	at org.gradle.api.internal.tasks.compile.CleaningJavaCompilerSupport.execute(CleaningJavaCompilerSupport.java:24)
	at org.gradle.api.tasks.compile.JavaCompile.performCompilation(JavaCompile.java:87)
	at org.gradle.api.tasks.compile.JavaCompile.compile(JavaCompile.java:65)
	at org.gradle.api.tasks.compile.JavaCompile.compile(JavaCompile.java:53)
	at org.gradle.internal.reflect.JavaMethod.invoke(JavaMethod.java:63)
	at org.gradle.api.internal.project.taskfactory.AnnotationProcessingTaskFactory$IncrementalTaskAction.doExecute(AnnotationProcessingTaskFactory.java:235)
	at org.gradle.api.internal.project.taskfactory.AnnotationProcessingTaskFactory$StandardTaskAction.execute(AnnotationProcessingTaskFactory.java:211)
	at org.gradle.api.internal.project.taskfactory.AnnotationProcessingTaskFactory$IncrementalTaskAction.execute(AnnotationProcessingTaskFactory.java:222)
	at org.gradle.api.internal.project.taskfactory.AnnotationProcessingTaskFactory$StandardTaskAction.execute(AnnotationProcessingTaskFactory.java:200)
	at org.gradle.api.internal.tasks.execution.ExecuteActionsTaskExecuter.executeAction(ExecuteActionsTaskExecuter.java:80)
	at org.gradle.api.internal.tasks.execution.ExecuteActionsTaskExecuter.executeActions(ExecuteActionsTaskExecuter.java:61)
	... 47 more


BUILD FAILED

Total time: 21.797 secs
Build step 'Invoke Gradle script' changed build result to FAILURE
Build step 'Invoke Gradle script' marked build as failure
Archiving artifacts
Recording fingerprints
Collecting metadata...
Metadata collection done.
Started calculate disk usage of build
Finished Calculation of disk usage of build in 0 seconds
Started calculate disk usage of workspace
Finished Calculation of disk usage of workspace in  4 second
Finished: FAILURE