FailedConsole Output

Started by an SCM change
Building in workspace /var/lib/jenkins/workspace/irclib
Cloning the remote Git repository
Cloning repository https://github.com/progwml6/IRCLib.git
 > git init /var/lib/jenkins/workspace/irclib # timeout=10
Fetching upstream changes from https://github.com/progwml6/IRCLib.git
 > git --version # timeout=10
 > git -c core.askpass=true fetch --tags --progress https://github.com/progwml6/IRCLib.git +refs/heads/*:refs/remotes/origin/*
 > git config remote.origin.url https://github.com/progwml6/IRCLib.git # timeout=10
 > git config --add remote.origin.fetch +refs/heads/*:refs/remotes/origin/* # timeout=10
 > git config remote.origin.url https://github.com/progwml6/IRCLib.git # timeout=10
Fetching upstream changes from https://github.com/progwml6/IRCLib.git
 > git -c core.askpass=true fetch --tags --progress https://github.com/progwml6/IRCLib.git +refs/heads/*:refs/remotes/origin/*
Seen branch in repository origin/master
Seen 1 remote branch
Checking out Revision b0e670e2d06ed969e4a1953f7b26fee12059e38a (origin/master)
 > git config core.sparsecheckout # timeout=10
 > git checkout -f b0e670e2d06ed969e4a1953f7b26fee12059e38a
 > git rev-list b0e670e2d06ed969e4a1953f7b26fee12059e38a # timeout=10
[irclib] $ /bin/sh -xe /tmp/hudson2014414357568030529.sh
+ rm -rf build/libs
[Gradle] - Launching build.
[irclib] $ /var/lib/jenkins/workspace/irclib/gradlew -s -Plocal_maven=/var/www/dvs1/files/maven build uploadArchives
Downloading https://services.gradle.org/distributions/gradle-2.4-bin.zip
.............................................................................................................................................................................................................................................................................................................................................................................................................................................................................................................................................................................................................................................................................................................................................................................................................................................................................................................................................................................................................................................................................................................................................................................................................................................................................................................................................................................................................................................................................................................................................................................................................................................................................................................................................................................................................................................................................................................................................................................................................................................................................................................................................................................................................................................................................................................................................................
Unzipping /var/lib/jenkins/workspace/irclib/wrapper/dists/gradle-2.4-bin/1lebsnfoptv8qpa10w6kyy5mp/gradle-2.4-bin.zip to /var/lib/jenkins/workspace/irclib/wrapper/dists/gradle-2.4-bin/1lebsnfoptv8qpa10w6kyy5mp
Set executable permissions for: /var/lib/jenkins/workspace/irclib/wrapper/dists/gradle-2.4-bin/1lebsnfoptv8qpa10w6kyy5mp/gradle-2.4/bin/gradle
:compileJava
Download https://repo1.maven.org/maven2/com/google/guava/guava/17.0/guava-17.0.pom
Download https://repo1.maven.org/maven2/com/google/guava/guava-parent/17.0/guava-parent-17.0.pom
Download https://repo1.maven.org/maven2/org/sonatype/oss/oss-parent/7/oss-parent-7.pom
Download https://repo1.maven.org/maven2/com/google/guava/guava/17.0/guava-17.0.jar
warning: [options] bootstrap class path not set in conjunction with -source 1.6
1 warning
:processResources UP-TO-DATE
:classes
:jar
:sourcesJar
:assemble
:compileTestJava UP-TO-DATE
:processTestResources UP-TO-DATE
:testClasses UP-TO-DATE
:test UP-TO-DATE
:check UP-TO-DATE
:build
:uploadArchivesSpecified destination directory cannot be created: /var/www/dvs1/files/maven/irclib/irclib/1.0.0-7
 FAILED

FAILURE: Build failed with an exception.

* What went wrong:
Execution failed for task ':uploadArchives'.
> Could not publish configuration 'archives'
   > Error deploying artifact 'irclib:irclib:jar': Error deploying artifact: Specified destination directory cannot be created: /var/www/dvs1/files/maven/irclib/irclib/1.0.0-7

* Try:
Run with --info or --debug option to get more log output.

* Exception is:
org.gradle.api.tasks.TaskExecutionException: Execution failed for task ':uploadArchives'.
	at org.gradle.api.internal.tasks.execution.ExecuteActionsTaskExecuter.executeActions(ExecuteActionsTaskExecuter.java:69)
	at org.gradle.api.internal.tasks.execution.ExecuteActionsTaskExecuter.execute(ExecuteActionsTaskExecuter.java:46)
	at org.gradle.api.internal.tasks.execution.PostExecutionAnalysisTaskExecuter.execute(PostExecutionAnalysisTaskExecuter.java:35)
	at org.gradle.api.internal.tasks.execution.SkipUpToDateTaskExecuter.execute(SkipUpToDateTaskExecuter.java:64)
	at org.gradle.api.internal.tasks.execution.ValidatingTaskExecuter.execute(ValidatingTaskExecuter.java:58)
	at org.gradle.api.internal.tasks.execution.SkipEmptySourceFilesTaskExecuter.execute(SkipEmptySourceFilesTaskExecuter.java:42)
	at org.gradle.api.internal.tasks.execution.SkipTaskWithNoActionsExecuter.execute(SkipTaskWithNoActionsExecuter.java:52)
	at org.gradle.api.internal.tasks.execution.SkipOnlyIfTaskExecuter.execute(SkipOnlyIfTaskExecuter.java:53)
	at org.gradle.api.internal.tasks.execution.ExecuteAtMostOnceTaskExecuter.execute(ExecuteAtMostOnceTaskExecuter.java:43)
	at org.gradle.api.internal.AbstractTask.executeWithoutThrowingTaskFailure(AbstractTask.java:310)
	at org.gradle.execution.taskgraph.AbstractTaskPlanExecutor$TaskExecutorWorker.executeTask(AbstractTaskPlanExecutor.java:79)
	at org.gradle.execution.taskgraph.AbstractTaskPlanExecutor$TaskExecutorWorker.processTask(AbstractTaskPlanExecutor.java:63)
	at org.gradle.execution.taskgraph.AbstractTaskPlanExecutor$TaskExecutorWorker.run(AbstractTaskPlanExecutor.java:51)
	at org.gradle.execution.taskgraph.DefaultTaskPlanExecutor.process(DefaultTaskPlanExecutor.java:23)
	at org.gradle.execution.taskgraph.DefaultTaskGraphExecuter.execute(DefaultTaskGraphExecuter.java:88)
	at org.gradle.execution.SelectedTaskExecutionAction.execute(SelectedTaskExecutionAction.java:37)
	at org.gradle.execution.DefaultBuildExecuter.execute(DefaultBuildExecuter.java:62)
	at org.gradle.execution.DefaultBuildExecuter.access$200(DefaultBuildExecuter.java:23)
	at org.gradle.execution.DefaultBuildExecuter$2.proceed(DefaultBuildExecuter.java:68)
	at org.gradle.execution.DryRunBuildExecutionAction.execute(DryRunBuildExecutionAction.java:32)
	at org.gradle.execution.DefaultBuildExecuter.execute(DefaultBuildExecuter.java:62)
	at org.gradle.execution.DefaultBuildExecuter.execute(DefaultBuildExecuter.java:55)
	at org.gradle.initialization.DefaultGradleLauncher.doBuildStages(DefaultGradleLauncher.java:149)
	at org.gradle.initialization.DefaultGradleLauncher.doBuild(DefaultGradleLauncher.java:106)
	at org.gradle.initialization.DefaultGradleLauncher.run(DefaultGradleLauncher.java:86)
	at org.gradle.launcher.exec.InProcessBuildActionExecuter$DefaultBuildController.run(InProcessBuildActionExecuter.java:90)
	at org.gradle.tooling.internal.provider.ExecuteBuildActionRunner.run(ExecuteBuildActionRunner.java:28)
	at org.gradle.launcher.exec.ChainingBuildActionRunner.run(ChainingBuildActionRunner.java:35)
	at org.gradle.launcher.exec.InProcessBuildActionExecuter.execute(InProcessBuildActionExecuter.java:41)
	at org.gradle.launcher.exec.InProcessBuildActionExecuter.execute(InProcessBuildActionExecuter.java:28)
	at org.gradle.launcher.exec.DaemonUsageSuggestingBuildActionExecuter.execute(DaemonUsageSuggestingBuildActionExecuter.java:50)
	at org.gradle.launcher.exec.DaemonUsageSuggestingBuildActionExecuter.execute(DaemonUsageSuggestingBuildActionExecuter.java:27)
	at org.gradle.launcher.cli.RunBuildAction.run(RunBuildAction.java:40)
	at org.gradle.internal.Actions$RunnableActionAdapter.execute(Actions.java:169)
	at org.gradle.launcher.cli.CommandLineActionFactory$ParseAndBuildAction.execute(CommandLineActionFactory.java:237)
	at org.gradle.launcher.cli.CommandLineActionFactory$ParseAndBuildAction.execute(CommandLineActionFactory.java:210)
	at org.gradle.launcher.cli.JavaRuntimeValidationAction.execute(JavaRuntimeValidationAction.java:35)
	at org.gradle.launcher.cli.JavaRuntimeValidationAction.execute(JavaRuntimeValidationAction.java:24)
	at org.gradle.launcher.cli.CommandLineActionFactory$WithLogging.execute(CommandLineActionFactory.java:206)
	at org.gradle.launcher.cli.CommandLineActionFactory$WithLogging.execute(CommandLineActionFactory.java:169)
	at org.gradle.launcher.cli.ExceptionReportingAction.execute(ExceptionReportingAction.java:33)
	at org.gradle.launcher.cli.ExceptionReportingAction.execute(ExceptionReportingAction.java:22)
	at org.gradle.launcher.Main.doAction(Main.java:33)
	at org.gradle.launcher.bootstrap.EntryPoint.run(EntryPoint.java:45)
	at org.gradle.launcher.bootstrap.ProcessBootstrap.runNoExit(ProcessBootstrap.java:54)
	at org.gradle.launcher.bootstrap.ProcessBootstrap.run(ProcessBootstrap.java:35)
	at org.gradle.launcher.GradleMain.main(GradleMain.java:23)
	at org.gradle.wrapper.BootstrapMainStarter.start(BootstrapMainStarter.java:30)
	at org.gradle.wrapper.WrapperExecutor.execute(WrapperExecutor.java:127)
	at org.gradle.wrapper.GradleWrapperMain.main(GradleWrapperMain.java:61)
Caused by: org.gradle.api.artifacts.PublishException: Could not publish configuration 'archives'
	at org.gradle.api.tasks.Upload.upload(Upload.java:66)
	at org.gradle.internal.reflect.JavaMethod.invoke(JavaMethod.java:75)
	at org.gradle.api.internal.project.taskfactory.AnnotationProcessingTaskFactory$StandardTaskAction.doExecute(AnnotationProcessingTaskFactory.java:226)
	at org.gradle.api.internal.project.taskfactory.AnnotationProcessingTaskFactory$StandardTaskAction.execute(AnnotationProcessingTaskFactory.java:219)
	at org.gradle.api.internal.project.taskfactory.AnnotationProcessingTaskFactory$StandardTaskAction.execute(AnnotationProcessingTaskFactory.java:208)
	at org.gradle.api.internal.AbstractTask$TaskActionWrapper.execute(AbstractTask.java:589)
	at org.gradle.api.internal.AbstractTask$TaskActionWrapper.execute(AbstractTask.java:572)
	at org.gradle.api.internal.tasks.execution.ExecuteActionsTaskExecuter.executeAction(ExecuteActionsTaskExecuter.java:80)
	at org.gradle.api.internal.tasks.execution.ExecuteActionsTaskExecuter.executeActions(ExecuteActionsTaskExecuter.java:61)
	... 49 more
Caused by: org.gradle.api.GradleException: Error deploying artifact 'irclib:irclib:jar': Error deploying artifact: Specified destination directory cannot be created: /var/www/dvs1/files/maven/irclib/irclib/1.0.0-7
	at org.gradle.api.publication.maven.internal.action.MavenDeployAction.publishArtifact(MavenDeployAction.java:64)
	at org.gradle.api.publication.maven.internal.action.AbstractMavenPublishAction.doPublish(AbstractMavenPublishAction.java:104)
	at org.gradle.api.publication.maven.internal.action.AbstractMavenPublishAction.publish(AbstractMavenPublishAction.java:84)
	at org.gradle.api.publication.maven.internal.action.MavenDeployAction.publish(MavenDeployAction.java:33)
	at org.gradle.api.publication.maven.internal.deployer.AbstractMavenResolver.execute(AbstractMavenResolver.java:109)
	at org.gradle.api.publication.maven.internal.deployer.AbstractMavenResolver.publish(AbstractMavenResolver.java:102)
	at org.gradle.api.publication.maven.internal.deployer.AbstractMavenResolver.publish(AbstractMavenResolver.java:81)
	at org.gradle.api.publication.maven.internal.deployer.BaseMavenDeployer.publish(BaseMavenDeployer.java:34)
	at org.gradle.api.internal.artifacts.ivyservice.DefaultIvyDependencyPublisher.publish(DefaultIvyDependencyPublisher.java:46)
	at org.gradle.api.internal.artifacts.ivyservice.IvyBackedArtifactPublisher$1.execute(IvyBackedArtifactPublisher.java:79)
	at org.gradle.api.internal.artifacts.ivyservice.IvyBackedArtifactPublisher$1.execute(IvyBackedArtifactPublisher.java:54)
	at org.gradle.internal.Transformers$4.transform(Transformers.java:137)
	at org.gradle.api.internal.artifacts.ivyservice.DefaultIvyContextManager.withIvy(DefaultIvyContextManager.java:61)
	at org.gradle.api.internal.artifacts.ivyservice.DefaultIvyContextManager.withIvy(DefaultIvyContextManager.java:39)
	at org.gradle.api.internal.artifacts.ivyservice.IvyBackedArtifactPublisher.publish(IvyBackedArtifactPublisher.java:54)
	at org.gradle.api.tasks.Upload.upload(Upload.java:64)
	... 57 more
Caused by: org.apache.maven.artifact.deployer.ArtifactDeploymentException: Error deploying artifact: Specified destination directory cannot be created: /var/www/dvs1/files/maven/irclib/irclib/1.0.0-7
	at org.apache.maven.artifact.deployer.DefaultArtifactDeployer.deploy(DefaultArtifactDeployer.java:121)
	at org.gradle.api.publication.maven.internal.action.MavenDeployAction.publishArtifact(MavenDeployAction.java:62)
	... 72 more
Caused by: org.apache.maven.wagon.TransferFailedException: Specified destination directory cannot be created: /var/www/dvs1/files/maven/irclib/irclib/1.0.0-7
	at org.apache.maven.wagon.AbstractWagon.createParentDirectories(AbstractWagon.java:253)
	at org.apache.maven.wagon.providers.file.FileWagon.fillOutputData(FileWagon.java:101)
	at org.apache.maven.wagon.StreamWagon.getOutputStream(StreamWagon.java:188)
	at org.apache.maven.wagon.StreamWagon.put(StreamWagon.java:159)
	at org.apache.maven.artifact.manager.DefaultWagonManager.putRemoteFile(DefaultWagonManager.java:317)
	at org.apache.maven.artifact.manager.DefaultWagonManager.putArtifact(DefaultWagonManager.java:227)
	at org.apache.maven.artifact.deployer.DefaultArtifactDeployer.deploy(DefaultArtifactDeployer.java:107)
	... 73 more


BUILD FAILED

Total time: 15.341 secs
Build step 'Invoke Gradle script' changed build result to FAILURE
Build step 'Invoke Gradle script' marked build as failure
Archiving artifacts
Recording fingerprints
Recording fingerprints
Collecting metadata...
Metadata collection done.
Started calculate disk usage of build
Finished Calculation of disk usage of build in 0 seconds
Started calculate disk usage of workspace
Finished Calculation of disk usage of workspace in 0 seconds
Finished: FAILURE