Console Output

Started by an SCM change
[EnvInject] - Loading node environment variables.
Building in workspace /var/lib/jenkins/workspace/RecMod
 > git rev-parse --is-inside-work-tree # timeout=10
Fetching changes from the remote Git repository
 > git config remote.origin.url https://github.com/SlimeKnights/RecMod.git # timeout=10
Fetching upstream changes from https://github.com/SlimeKnights/RecMod.git
 > git --version # timeout=10
 > git -c core.askpass=true fetch --tags --progress https://github.com/SlimeKnights/RecMod.git +refs/heads/*:refs/remotes/origin/*
Seen branch in repository origin/1.8
Seen branch in repository origin/master
Seen 2 remote branches
Checking out Revision 776a639184e4f424682cafd34b1ddf3690e3e052 (origin/master)
 > git config core.sparsecheckout # timeout=10
 > git checkout -f 776a639184e4f424682cafd34b1ddf3690e3e052
 > git rev-list 4cd9675357c58d86a4c47a1fea068d696857e438 # timeout=10
 > git tag -a -f -m Jenkins Build #30 jenkins-RecMod-30 # timeout=10
[RecMod] $ /bin/sh -xe /tmp/hudson3921114546783305123.sh
+ rm -Rf build/libs/
[Gradle] - Launching build.
[RecMod] $ /var/lib/jenkins/workspace/RecMod/gradlew -s build
Download http://files.minecraftforge.net/maven/net/minecraftforge/gradle/ForgeGradle/2.1-SNAPSHOT/ForgeGradle-2.1-20160119.100521-20.pom
Download http://files.minecraftforge.net/maven/net/minecraftforge/fernflower/2.0-SNAPSHOT/fernflower-2.0-20151214.100946-17.pom
Download http://files.minecraftforge.net/maven/net/minecraftforge/gradle/ForgeGradle/2.1-SNAPSHOT/ForgeGradle-2.1-20160119.100521-20.jar
Download http://files.minecraftforge.net/maven/net/minecraftforge/fernflower/2.0-SNAPSHOT/fernflower-2.0-20151214.100946-17.jar

FAILURE: Build failed with an exception.

* Where:
Build file '/var/lib/jenkins/workspace/RecMod/build.gradle' line: 37

* What went wrong:
A problem occurred evaluating root project 'RecStatusMod'.
> ForgeGradle 2.0 requires Gradle 2.3 or above.

* Try:
Run with --info or --debug option to get more log output.

* Exception is:
org.gradle.api.GradleScriptException: A problem occurred evaluating root project 'RecStatusMod'.
	at org.gradle.groovy.scripts.internal.DefaultScriptRunnerFactory$ScriptRunnerImpl.run(DefaultScriptRunnerFactory.java:54)
	at org.gradle.configuration.DefaultScriptPluginFactory$ScriptPluginImpl.apply(DefaultScriptPluginFactory.java:156)
	at org.gradle.configuration.project.BuildScriptProcessor.execute(BuildScriptProcessor.java:38)
	at org.gradle.configuration.project.BuildScriptProcessor.execute(BuildScriptProcessor.java:25)
	at org.gradle.configuration.project.ConfigureActionsProjectEvaluator.evaluate(ConfigureActionsProjectEvaluator.java:34)
	at org.gradle.configuration.project.LifecycleProjectEvaluator.evaluate(LifecycleProjectEvaluator.java:55)
	at org.gradle.api.internal.project.AbstractProject.evaluate(AbstractProject.java:507)
	at org.gradle.api.internal.project.AbstractProject.evaluate(AbstractProject.java:82)
	at org.gradle.configuration.DefaultBuildConfigurer.configure(DefaultBuildConfigurer.java:31)
	at org.gradle.initialization.DefaultGradleLauncher.doBuildStages(DefaultGradleLauncher.java:142)
	at org.gradle.initialization.DefaultGradleLauncher.doBuild(DefaultGradleLauncher.java:113)
	at org.gradle.initialization.DefaultGradleLauncher.run(DefaultGradleLauncher.java:81)
	at org.gradle.launcher.exec.InProcessBuildActionExecuter$DefaultBuildController.run(InProcessBuildActionExecuter.java:64)
	at org.gradle.launcher.cli.ExecuteBuildAction.run(ExecuteBuildAction.java:33)
	at org.gradle.launcher.cli.ExecuteBuildAction.run(ExecuteBuildAction.java:24)
	at org.gradle.launcher.exec.InProcessBuildActionExecuter.execute(InProcessBuildActionExecuter.java:35)
	at org.gradle.launcher.exec.InProcessBuildActionExecuter.execute(InProcessBuildActionExecuter.java:26)
	at org.gradle.launcher.cli.RunBuildAction.run(RunBuildAction.java:50)
	at org.gradle.internal.Actions$RunnableActionAdapter.execute(Actions.java:171)
	at org.gradle.launcher.cli.CommandLineActionFactory$ParseAndBuildAction.execute(CommandLineActionFactory.java:201)
	at org.gradle.launcher.cli.CommandLineActionFactory$ParseAndBuildAction.execute(CommandLineActionFactory.java:174)
	at org.gradle.launcher.cli.CommandLineActionFactory$WithLogging.execute(CommandLineActionFactory.java:170)
	at org.gradle.launcher.cli.CommandLineActionFactory$WithLogging.execute(CommandLineActionFactory.java:139)
	at org.gradle.launcher.cli.ExceptionReportingAction.execute(ExceptionReportingAction.java:33)
	at org.gradle.launcher.cli.ExceptionReportingAction.execute(ExceptionReportingAction.java:22)
	at org.gradle.launcher.Main.doAction(Main.java:46)
	at org.gradle.launcher.bootstrap.EntryPoint.run(EntryPoint.java:45)
	at org.gradle.launcher.Main.main(Main.java:37)
	at org.gradle.launcher.bootstrap.ProcessBootstrap.runNoExit(ProcessBootstrap.java:50)
	at org.gradle.launcher.bootstrap.ProcessBootstrap.run(ProcessBootstrap.java:32)
	at org.gradle.launcher.GradleMain.main(GradleMain.java:23)
	at org.gradle.wrapper.BootstrapMainStarter.start(BootstrapMainStarter.java:30)
	at org.gradle.wrapper.WrapperExecutor.execute(WrapperExecutor.java:127)
	at org.gradle.wrapper.GradleWrapperMain.main(GradleWrapperMain.java:58)
Caused by: java.lang.RuntimeException: ForgeGradle 2.0 requires Gradle 2.3 or above.
	at net.minecraftforge.gradle.common.BasePlugin.apply(BasePlugin.java:107)
	at net.minecraftforge.gradle.common.BasePlugin.apply(BasePlugin.java:87)
	at org.gradle.api.internal.plugins.DefaultPluginContainer.providePlugin(DefaultPluginContainer.java:104)
	at org.gradle.api.internal.plugins.DefaultPluginContainer.addPluginInternal(DefaultPluginContainer.java:68)
	at org.gradle.api.internal.plugins.DefaultPluginContainer.apply(DefaultPluginContainer.java:34)
	at org.gradle.api.internal.plugins.DefaultObjectConfigurationAction.applyPlugin(DefaultObjectConfigurationAction.java:101)
	at org.gradle.api.internal.plugins.DefaultObjectConfigurationAction.access$200(DefaultObjectConfigurationAction.java:32)
	at org.gradle.api.internal.plugins.DefaultObjectConfigurationAction$3.run(DefaultObjectConfigurationAction.java:72)
	at org.gradle.api.internal.plugins.DefaultObjectConfigurationAction.execute(DefaultObjectConfigurationAction.java:114)
	at org.gradle.api.internal.project.AbstractPluginAware.apply(AbstractPluginAware.java:39)
	at org.gradle.api.Project$apply.call(Unknown Source)
	at org.gradle.api.internal.project.ProjectScript.apply(ProjectScript.groovy:34)
	at org.gradle.api.Script$apply.callCurrent(Unknown Source)
	at build_1naslfe84j3u917k6up4gn29n2.run(/var/lib/jenkins/workspace/RecMod/build.gradle:37)
	at org.gradle.groovy.scripts.internal.DefaultScriptRunnerFactory$ScriptRunnerImpl.run(DefaultScriptRunnerFactory.java:52)
	... 33 more


BUILD FAILED

Total time: 17.208 secs
Build step 'Invoke Gradle script' changed build result to FAILURE
Build step 'Invoke Gradle script' marked build as failure
Archiving artifacts
Recording fingerprints
Collecting metadata...
Metadata collection done.
Started calculate disk usage of build
Finished Calculation of disk usage of build in 0 seconds
Started calculate disk usage of workspace
Finished Calculation of disk usage of workspace in 0 seconds
Finished: FAILURE