FailedConsole Output

Started by an SCM change
Running as SYSTEM
[EnvInject] - Loading node environment variables.
Building in workspace /var/lib/jenkins/workspace/Chisels-and-Bits
No credentials specified
 > git rev-parse --is-inside-work-tree # timeout=10
Fetching changes from the remote Git repository
 > git config remote.origin.url https://github.com/AlgorithmX2/Chisels-and-Bits.git # timeout=10
Fetching upstream changes from https://github.com/AlgorithmX2/Chisels-and-Bits.git
 > git --version # timeout=10
 > git fetch --tags --progress https://github.com/AlgorithmX2/Chisels-and-Bits.git +refs/heads/*:refs/remotes/origin/* # timeout=10
Seen branch in repository origin/1.10
Seen branch in repository origin/1.10.2
Seen branch in repository origin/1.10_sharing
Seen branch in repository origin/1.11
Seen branch in repository origin/1.11.2
Seen branch in repository origin/1.12
Seen branch in repository origin/1.12_param
Seen branch in repository origin/1.12_sharing
Seen branch in repository origin/1.8
Seen branch in repository origin/1.8.9
Seen branch in repository origin/1.9
Seen branch in repository origin/1.9.4
Seen branch in repository origin/Crossworld_NBT_PRIMARY_STATE
Seen branch in repository origin/gh-pages
Seen branch in repository origin/refactor_BitState
Seen branch in repository origin/sharing
Seen 16 remote branches
 > git show-ref --tags -d # timeout=10
Checking out Revision cd765700764046e7c4c97455e036c6bd866d1de7 (origin/1.12)
 > git config core.sparsecheckout # timeout=10
 > git checkout -f cd765700764046e7c4c97455e036c6bd866d1de7 # timeout=10
Commit message: "French translation (fr_fr) (#463)"
 > git rev-list --no-walk 2161ed29b11941a676d6e367e00b78b32d16f908 # timeout=10
[Chisels-and-Bits] $ /bin/sh -xe /tmp/jenkins1450068790541965745.sh
+ rm -rf build/libs
[Gradle] - Launching build.
[Chisels-and-Bits] $ /var/lib/jenkins/workspace/Chisels-and-Bits/gradlew -s clean setupCIWorkspace
Download http://files.minecraftforge.net/maven/net/minecraftforge/gradle/ForgeGradle/2.3-SNAPSHOT/ForgeGradle-2.3-20190215.204323-39.pom
Download https://jcenter.bintray.com/com/google/guava/guava/18.0/guava-18.0.pom
Download https://jcenter.bintray.com/com/google/guava/guava-parent/18.0/guava-parent-18.0.pom
Download https://jcenter.bintray.com/org/sonatype/oss/oss-parent/7/oss-parent-7.pom
Download https://jcenter.bintray.com/net/sf/opencsv/opencsv/2.3/opencsv-2.3.pom
Download https://jcenter.bintray.com/com/cloudbees/diff4j/1.1/diff4j-1.1.pom
Download https://jcenter.bintray.com/com/cloudbees/cloudbees-oss-parent/1/cloudbees-oss-parent-1.pom
Download https://jcenter.bintray.com/com/github/abrarsyed/jastyle/jAstyle/1.3/jAstyle-1.3.pom
Download https://jcenter.bintray.com/net/sf/trove4j/trove4j/2.1.0/trove4j-2.1.0.pom
Download https://jcenter.bintray.com/com/github/jponge/lzma-java/1.3/lzma-java-1.3.pom
Download https://jcenter.bintray.com/com/nothome/javaxdelta/2.0.1/javaxdelta-2.0.1.pom
Download https://jcenter.bintray.com/com/google/code/gson/gson/2.2.4/gson-2.2.4.pom
Download https://jcenter.bintray.com/com/github/tony19/named-regexp/0.2.3/named-regexp-0.2.3.pom
Download http://files.minecraftforge.net/maven/net/minecraftforge/forgeflower/1.0.342-SNAPSHOT/forgeflower-1.0.342-20171208.041249-7.pom
Download https://jcenter.bintray.com/org/apache/httpcomponents/httpclient/4.3.3/httpclient-4.3.3.pom
Download https://jcenter.bintray.com/org/apache/httpcomponents/httpcomponents-client/4.3.3/httpcomponents-client-4.3.3.pom
Download https://jcenter.bintray.com/org/apache/httpcomponents/project/7/project-7.pom
Download https://jcenter.bintray.com/org/apache/apache/13/apache-13.pom
Download https://jcenter.bintray.com/org/apache/httpcomponents/httpmime/4.3.3/httpmime-4.3.3.pom
Download https://jcenter.bintray.com/org/jvnet/localizer/localizer/1.12/localizer-1.12.pom
Download https://jcenter.bintray.com/org/jvnet/localizer/localizer-parent/1.12/localizer-parent-1.12.pom
Download https://jcenter.bintray.com/commons-io/commons-io/1.4/commons-io-1.4.pom
Download https://jcenter.bintray.com/org/apache/commons/commons-parent/7/commons-parent-7.pom
Download https://jcenter.bintray.com/org/apache/apache/4/apache-4.pom
Download https://jcenter.bintray.com/trove/trove/1.0.2/trove-1.0.2.pom
Download https://jcenter.bintray.com/org/apache/httpcomponents/httpcore/4.3.2/httpcore-4.3.2.pom
Download https://jcenter.bintray.com/org/apache/httpcomponents/httpcomponents-core/4.3.2/httpcomponents-core-4.3.2.pom
Download https://jcenter.bintray.com/commons-logging/commons-logging/1.1.3/commons-logging-1.1.3.pom
Download https://jcenter.bintray.com/org/apache/commons/commons-parent/28/commons-parent-28.pom
Download https://jcenter.bintray.com/commons-codec/commons-codec/1.6/commons-codec-1.6.pom
Download https://jcenter.bintray.com/org/apache/commons/commons-parent/22/commons-parent-22.pom
Download https://jcenter.bintray.com/org/apache/apache/9/apache-9.pom
Download http://files.minecraftforge.net/maven/net/minecraftforge/gradle/ForgeGradle/2.3-SNAPSHOT/ForgeGradle-2.3-20190215.204323-39.jar
Download https://jcenter.bintray.com/com/google/guava/guava/18.0/guava-18.0.jar
Download https://jcenter.bintray.com/net/sf/opencsv/opencsv/2.3/opencsv-2.3.jar
Download https://jcenter.bintray.com/com/cloudbees/diff4j/1.1/diff4j-1.1.jar
Download https://jcenter.bintray.com/com/github/abrarsyed/jastyle/jAstyle/1.3/jAstyle-1.3.jar
Download https://jcenter.bintray.com/net/sf/trove4j/trove4j/2.1.0/trove4j-2.1.0.jar
Download https://jcenter.bintray.com/com/github/jponge/lzma-java/1.3/lzma-java-1.3.jar
Download https://jcenter.bintray.com/com/nothome/javaxdelta/2.0.1/javaxdelta-2.0.1.jar
Download https://jcenter.bintray.com/com/google/code/gson/gson/2.2.4/gson-2.2.4.jar
Download https://jcenter.bintray.com/com/github/tony19/named-regexp/0.2.3/named-regexp-0.2.3.jar
Download http://files.minecraftforge.net/maven/net/minecraftforge/forgeflower/1.0.342-SNAPSHOT/forgeflower-1.0.342-20171208.041249-7.jar
Download https://jcenter.bintray.com/org/apache/httpcomponents/httpclient/4.3.3/httpclient-4.3.3.jar
Download https://jcenter.bintray.com/org/apache/httpcomponents/httpmime/4.3.3/httpmime-4.3.3.jar
Download https://jcenter.bintray.com/org/jvnet/localizer/localizer/1.12/localizer-1.12.jar
Download https://jcenter.bintray.com/commons-io/commons-io/1.4/commons-io-1.4.jar
Download https://jcenter.bintray.com/trove/trove/1.0.2/trove-1.0.2.jar
Download https://jcenter.bintray.com/org/apache/httpcomponents/httpcore/4.3.2/httpcore-4.3.2.jar
Download https://jcenter.bintray.com/commons-logging/commons-logging/1.1.3/commons-logging-1.1.3.jar
Download https://jcenter.bintray.com/commons-codec/commons-codec/1.6/commons-codec-1.6.jar
This mapping 'snapshot_20161111' was designed for MC 1.10.2! Use at your own peril.
#################################################
         ForgeGradle 2.3-SNAPSHOT-7764e3e        
  https://github.com/MinecraftForge/ForgeGradle  
#################################################
                 Powered by MCP                  
             http://modcoderpack.com             
     by: Searge, ProfMobius, R4wk, ZeuX          
     Fesh0r, IngisKahn, bspkrs, LexManos         
#################################################
Found AccessTransformer: chiselsandbits_at.cfg
Download http://dvs1.progwml6.com/files/maven/mezz/jei/jei_1.12/4.7.2.76/jei_1.12-4.7.2.76.pom

FAILURE: Build failed with an exception.

* What went wrong:
A problem occurred configuring root project 'Chisels-and-Bits'.
> Could not resolve all dependencies for configuration ':deobfCompile'.
   > Could not resolve MCMultiPart2:MCMultiPart:2.2.2.
     Required by:
         mod.chiselsandbits:Chisels-and-Bits:14.0.177
      > Could not resolve MCMultiPart2:MCMultiPart:2.2.2.
         > Could not get resource 'http://maven.amadornes.com/MCMultiPart2/MCMultiPart/2.2.2/MCMultiPart-2.2.2.pom'.
            > Could not GET 'http://maven.amadornes.com/MCMultiPart2/MCMultiPart/2.2.2/MCMultiPart-2.2.2.pom'. Received status code 403 from server: Forbidden

* Try:
Run with --info or --debug option to get more log output.

* Exception is:
org.gradle.api.ProjectConfigurationException: A problem occurred configuring root project 'Chisels-and-Bits'.
	at org.gradle.configuration.project.LifecycleProjectEvaluator.addConfigurationFailure(LifecycleProjectEvaluator.java:79)
	at org.gradle.configuration.project.LifecycleProjectEvaluator.notifyAfterEvaluate(LifecycleProjectEvaluator.java:74)
	at org.gradle.configuration.project.LifecycleProjectEvaluator.evaluate(LifecycleProjectEvaluator.java:61)
	at org.gradle.api.internal.project.AbstractProject.evaluate(AbstractProject.java:540)
	at org.gradle.api.internal.project.AbstractProject.evaluate(AbstractProject.java:93)
	at org.gradle.execution.TaskPathProjectEvaluator.configureHierarchy(TaskPathProjectEvaluator.java:42)
	at org.gradle.configuration.DefaultBuildConfigurer.configure(DefaultBuildConfigurer.java:35)
	at org.gradle.initialization.DefaultGradleLauncher$2.run(DefaultGradleLauncher.java:124)
	at org.gradle.internal.Factories$1.create(Factories.java:22)
	at org.gradle.internal.progress.DefaultBuildOperationExecutor.run(DefaultBuildOperationExecutor.java:91)
	at org.gradle.internal.progress.DefaultBuildOperationExecutor.run(DefaultBuildOperationExecutor.java:53)
	at org.gradle.initialization.DefaultGradleLauncher.doBuildStages(DefaultGradleLauncher.java:121)
	at org.gradle.initialization.DefaultGradleLauncher.access$200(DefaultGradleLauncher.java:32)
	at org.gradle.initialization.DefaultGradleLauncher$1.create(DefaultGradleLauncher.java:98)
	at org.gradle.initialization.DefaultGradleLauncher$1.create(DefaultGradleLauncher.java:92)
	at org.gradle.internal.progress.DefaultBuildOperationExecutor.run(DefaultBuildOperationExecutor.java:91)
	at org.gradle.internal.progress.DefaultBuildOperationExecutor.run(DefaultBuildOperationExecutor.java:63)
	at org.gradle.initialization.DefaultGradleLauncher.doBuild(DefaultGradleLauncher.java:92)
	at org.gradle.initialization.DefaultGradleLauncher.run(DefaultGradleLauncher.java:83)
	at org.gradle.launcher.exec.InProcessBuildActionExecuter$DefaultBuildController.run(InProcessBuildActionExecuter.java:99)
	at org.gradle.tooling.internal.provider.ExecuteBuildActionRunner.run(ExecuteBuildActionRunner.java:28)
	at org.gradle.launcher.exec.ChainingBuildActionRunner.run(ChainingBuildActionRunner.java:35)
	at org.gradle.launcher.exec.InProcessBuildActionExecuter.execute(InProcessBuildActionExecuter.java:48)
	at org.gradle.launcher.exec.InProcessBuildActionExecuter.execute(InProcessBuildActionExecuter.java:30)
	at org.gradle.launcher.exec.ContinuousBuildActionExecuter.execute(ContinuousBuildActionExecuter.java:81)
	at org.gradle.launcher.exec.ContinuousBuildActionExecuter.execute(ContinuousBuildActionExecuter.java:46)
	at org.gradle.launcher.exec.DaemonUsageSuggestingBuildActionExecuter.execute(DaemonUsageSuggestingBuildActionExecuter.java:51)
	at org.gradle.launcher.exec.DaemonUsageSuggestingBuildActionExecuter.execute(DaemonUsageSuggestingBuildActionExecuter.java:28)
	at org.gradle.launcher.cli.RunBuildAction.run(RunBuildAction.java:43)
	at org.gradle.internal.Actions$RunnableActionAdapter.execute(Actions.java:173)
	at org.gradle.launcher.cli.CommandLineActionFactory$ParseAndBuildAction.execute(CommandLineActionFactory.java:239)
	at org.gradle.launcher.cli.CommandLineActionFactory$ParseAndBuildAction.execute(CommandLineActionFactory.java:212)
	at org.gradle.launcher.cli.JavaRuntimeValidationAction.execute(JavaRuntimeValidationAction.java:35)
	at org.gradle.launcher.cli.JavaRuntimeValidationAction.execute(JavaRuntimeValidationAction.java:24)
	at org.gradle.launcher.cli.ExceptionReportingAction.execute(ExceptionReportingAction.java:33)
	at org.gradle.launcher.cli.ExceptionReportingAction.execute(ExceptionReportingAction.java:22)
	at org.gradle.launcher.cli.CommandLineActionFactory$WithLogging.execute(CommandLineActionFactory.java:205)
	at org.gradle.launcher.cli.CommandLineActionFactory$WithLogging.execute(CommandLineActionFactory.java:169)
	at org.gradle.launcher.Main.doAction(Main.java:33)
	at org.gradle.launcher.bootstrap.EntryPoint.run(EntryPoint.java:45)
	at org.gradle.launcher.bootstrap.ProcessBootstrap.runNoExit(ProcessBootstrap.java:55)
	at org.gradle.launcher.bootstrap.ProcessBootstrap.run(ProcessBootstrap.java:36)
	at org.gradle.launcher.GradleMain.main(GradleMain.java:23)
	at org.gradle.wrapper.BootstrapMainStarter.start(BootstrapMainStarter.java:30)
	at org.gradle.wrapper.WrapperExecutor.execute(WrapperExecutor.java:127)
	at org.gradle.wrapper.GradleWrapperMain.main(GradleWrapperMain.java:61)
Caused by: org.gradle.api.artifacts.ResolveException: Could not resolve all dependencies for configuration ':deobfCompile'.
	at org.gradle.api.internal.artifacts.ivyservice.DefaultLenientConfiguration.rethrowFailure(DefaultLenientConfiguration.java:62)
	at org.gradle.api.internal.artifacts.ivyservice.DefaultResolvedConfiguration.rethrowFailure(DefaultResolvedConfiguration.java:36)
	at org.gradle.api.internal.artifacts.ivyservice.DefaultResolvedConfiguration.getResolvedArtifacts(DefaultResolvedConfiguration.java:59)
	at org.gradle.api.internal.artifacts.ivyservice.SelfResolvingDependencyConfigurationResolver$FilesAggregatingResolvedConfiguration.getResolvedArtifacts(SelfResolvingDependencyConfigurationResolver.java:92)
	at org.gradle.api.internal.artifacts.ivyservice.ErrorHandlingConfigurationResolver$ErrorHandlingResolvedConfiguration.getResolvedArtifacts(ErrorHandlingConfigurationResolver.java:221)
	at net.minecraftforge.gradle.user.UserBasePlugin.remapDeps(UserBasePlugin.java:698)
	at net.minecraftforge.gradle.user.UserBasePlugin$6.execute(UserBasePlugin.java:673)
	at net.minecraftforge.gradle.user.UserBasePlugin$6.execute(UserBasePlugin.java:663)
	at org.gradle.internal.event.BroadcastDispatch$ActionInvocationHandler.dispatch(BroadcastDispatch.java:93)
	at org.gradle.internal.event.BroadcastDispatch$ActionInvocationHandler.dispatch(BroadcastDispatch.java:82)
	at org.gradle.internal.event.AbstractBroadcastDispatch.dispatch(AbstractBroadcastDispatch.java:44)
	at org.gradle.internal.event.BroadcastDispatch.dispatch(BroadcastDispatch.java:79)
	at org.gradle.internal.event.BroadcastDispatch.dispatch(BroadcastDispatch.java:30)
	at org.gradle.internal.dispatch.ProxyDispatchAdapter$DispatchingInvocationHandler.invoke(ProxyDispatchAdapter.java:93)
	at com.sun.proxy.$Proxy11.afterEvaluate(Unknown Source)
	at org.gradle.configuration.project.LifecycleProjectEvaluator.notifyAfterEvaluate(LifecycleProjectEvaluator.java:67)
	... 44 more
Caused by: org.gradle.internal.resolve.ModuleVersionResolveException: Could not resolve MCMultiPart2:MCMultiPart:2.2.2.
Required by:
    mod.chiselsandbits:Chisels-and-Bits:14.0.177
	at org.gradle.api.internal.artifacts.ivyservice.ivyresolve.RepositoryChainComponentMetaDataResolver.resolveModule(RepositoryChainComponentMetaDataResolver.java:83)
	at org.gradle.api.internal.artifacts.ivyservice.ivyresolve.RepositoryChainComponentMetaDataResolver.resolve(RepositoryChainComponentMetaDataResolver.java:59)
	at org.gradle.api.internal.artifacts.ivyservice.resolveengine.ComponentResolversChain$ComponentMetaDataResolverChain.resolve(ComponentResolversChain.java:80)
	at org.gradle.api.internal.artifacts.ivyservice.clientmodule.ClientModuleResolver.resolve(ClientModuleResolver.java:44)
	at org.gradle.api.internal.artifacts.ivyservice.resolveengine.graph.DependencyGraphBuilder$ModuleVersionResolveState.resolve(DependencyGraphBuilder.java:564)
	at org.gradle.api.internal.artifacts.ivyservice.resolveengine.graph.DependencyGraphBuilder$ModuleVersionResolveState.getMetaData(DependencyGraphBuilder.java:574)
	at org.gradle.api.internal.artifacts.ivyservice.resolveengine.graph.DependencyGraphBuilder$DependencyEdge.calculateTargetConfigurations(DependencyGraphBuilder.java:260)
	at org.gradle.api.internal.artifacts.ivyservice.resolveengine.graph.DependencyGraphBuilder$DependencyEdge.attachToTargetConfigurations(DependencyGraphBuilder.java:234)
	at org.gradle.api.internal.artifacts.ivyservice.resolveengine.graph.DependencyGraphBuilder.traverseGraph(DependencyGraphBuilder.java:141)
	at org.gradle.api.internal.artifacts.ivyservice.resolveengine.graph.DependencyGraphBuilder.resolve(DependencyGraphBuilder.java:79)
	at org.gradle.api.internal.artifacts.ivyservice.resolveengine.DefaultArtifactDependencyResolver$1.execute(DefaultArtifactDependencyResolver.java:90)
	at org.gradle.api.internal.artifacts.ivyservice.resolveengine.DefaultArtifactDependencyResolver$1.execute(DefaultArtifactDependencyResolver.java:80)
	at org.gradle.internal.Transformers$4.transform(Transformers.java:169)
	at org.gradle.api.internal.artifacts.ivyservice.DefaultIvyContextManager.withIvy(DefaultIvyContextManager.java:61)
	at org.gradle.api.internal.artifacts.ivyservice.DefaultIvyContextManager.withIvy(DefaultIvyContextManager.java:39)
	at org.gradle.api.internal.artifacts.ivyservice.resolveengine.DefaultArtifactDependencyResolver.resolve(DefaultArtifactDependencyResolver.java:80)
	at org.gradle.api.internal.artifacts.ivyservice.CacheLockingArtifactDependencyResolver$1.run(CacheLockingArtifactDependencyResolver.java:41)
	at org.gradle.internal.Factories$1.create(Factories.java:22)
	at org.gradle.cache.internal.DefaultCacheAccess.useCache(DefaultCacheAccess.java:192)
	at org.gradle.cache.internal.DefaultCacheAccess.useCache(DefaultCacheAccess.java:175)
	at org.gradle.cache.internal.DefaultPersistentDirectoryStore.useCache(DefaultPersistentDirectoryStore.java:106)
	at org.gradle.cache.internal.DefaultCacheFactory$ReferenceTrackingCache.useCache(DefaultCacheFactory.java:187)
	at org.gradle.api.internal.artifacts.ivyservice.DefaultCacheLockingManager.useCache(DefaultCacheLockingManager.java:64)
	at org.gradle.api.internal.artifacts.ivyservice.CacheLockingArtifactDependencyResolver.resolve(CacheLockingArtifactDependencyResolver.java:39)
	at org.gradle.api.internal.artifacts.ivyservice.DefaultConfigurationResolver.resolve(DefaultConfigurationResolver.java:91)
	at org.gradle.api.internal.artifacts.ivyservice.SelfResolvingDependencyConfigurationResolver.resolve(SelfResolvingDependencyConfigurationResolver.java:40)
	at org.gradle.api.internal.artifacts.ivyservice.ShortCircuitEmptyConfigurationResolver.resolve(ShortCircuitEmptyConfigurationResolver.java:52)
	at org.gradle.api.internal.artifacts.ivyservice.ErrorHandlingConfigurationResolver.resolve(ErrorHandlingConfigurationResolver.java:43)
	at org.gradle.api.internal.artifacts.configurations.DefaultConfiguration.resolveGraphIfRequired(DefaultConfiguration.java:372)
	at org.gradle.api.internal.artifacts.configurations.DefaultConfiguration.resolveNow(DefaultConfiguration.java:347)
	at org.gradle.api.internal.artifacts.configurations.DefaultConfiguration.getResolvedConfiguration(DefaultConfiguration.java:340)
	at org.gradle.api.internal.artifacts.configurations.DefaultConfiguration_Decorated.getResolvedConfiguration(Unknown Source)
	... 55 more
Caused by: org.gradle.internal.resolve.ModuleVersionResolveException: Could not resolve MCMultiPart2:MCMultiPart:2.2.2.
	at org.gradle.api.internal.artifacts.ivyservice.ivyresolve.ErrorHandlingModuleComponentRepository$ErrorHandlingModuleComponentRepositoryAccess.resolveComponentMetaData(ErrorHandlingModuleComponentRepository.java:91)
	at org.gradle.api.internal.artifacts.ivyservice.ivyresolve.ComponentMetaDataResolveState.process(ComponentMetaDataResolveState.java:66)
	at org.gradle.api.internal.artifacts.ivyservice.ivyresolve.ComponentMetaDataResolveState.resolve(ComponentMetaDataResolveState.java:58)
	at org.gradle.api.internal.artifacts.ivyservice.ivyresolve.RepositoryChainComponentMetaDataResolver.findBestMatch(RepositoryChainComponentMetaDataResolver.java:116)
	at org.gradle.api.internal.artifacts.ivyservice.ivyresolve.RepositoryChainComponentMetaDataResolver.findBestMatch(RepositoryChainComponentMetaDataResolver.java:99)
	at org.gradle.api.internal.artifacts.ivyservice.ivyresolve.RepositoryChainComponentMetaDataResolver.resolveModule(RepositoryChainComponentMetaDataResolver.java:72)
	... 86 more
Caused by: org.gradle.api.resources.ResourceException: Could not get resource 'http://maven.amadornes.com/MCMultiPart2/MCMultiPart/2.2.2/MCMultiPart-2.2.2.pom'.
	at org.gradle.internal.resource.ResourceExceptions.failure(ResourceExceptions.java:69)
	at org.gradle.internal.resource.ResourceExceptions.getFailed(ResourceExceptions.java:52)
	at org.gradle.api.internal.artifacts.repositories.resolver.DefaultExternalResourceArtifactResolver.downloadStaticResource(DefaultExternalResourceArtifactResolver.java:95)
	at org.gradle.api.internal.artifacts.repositories.resolver.DefaultExternalResourceArtifactResolver.resolveArtifact(DefaultExternalResourceArtifactResolver.java:54)
	at org.gradle.api.internal.artifacts.repositories.resolver.ExternalResourceResolver.parseMetaDataFromArtifact(ExternalResourceResolver.java:164)
	at org.gradle.api.internal.artifacts.repositories.resolver.ExternalResourceResolver.resolveStaticDependency(ExternalResourceResolver.java:143)
	at org.gradle.api.internal.artifacts.repositories.resolver.MavenResolver.doResolveComponentMetaData(MavenResolver.java:93)
	at org.gradle.api.internal.artifacts.repositories.resolver.ExternalResourceResolver$RemoteRepositoryAccess.resolveComponentMetaData(ExternalResourceResolver.java:409)
	at org.gradle.api.internal.artifacts.ivyservice.ivyresolve.CacheLockReleasingModuleComponentsRepository$LockReleasingRepositoryAccess$2.run(CacheLockReleasingModuleComponentsRepository.java:71)
	at org.gradle.internal.Factories$1.create(Factories.java:22)
	at org.gradle.cache.internal.DefaultCacheAccess.longRunningOperation(DefaultCacheAccess.java:242)
	at org.gradle.cache.internal.DefaultCacheAccess.longRunningOperation(DefaultCacheAccess.java:313)
	at org.gradle.cache.internal.DefaultPersistentDirectoryStore.longRunningOperation(DefaultPersistentDirectoryStore.java:114)
	at org.gradle.cache.internal.DefaultCacheFactory$ReferenceTrackingCache.longRunningOperation(DefaultCacheFactory.java:179)
	at org.gradle.api.internal.artifacts.ivyservice.DefaultCacheLockingManager.longRunningOperation(DefaultCacheLockingManager.java:56)
	at org.gradle.api.internal.artifacts.ivyservice.ivyresolve.CacheLockReleasingModuleComponentsRepository$LockReleasingRepositoryAccess.resolveComponentMetaData(CacheLockReleasingModuleComponentsRepository.java:69)
	at org.gradle.api.internal.artifacts.ivyservice.ivyresolve.CachingModuleComponentRepository$ResolveAndCacheRepositoryAccess.resolveComponentMetaData(CachingModuleComponentRepository.java:297)
	at org.gradle.api.internal.artifacts.ivyservice.ivyresolve.BaseModuleComponentRepositoryAccess.resolveComponentMetaData(BaseModuleComponentRepositoryAccess.java:42)
	at org.gradle.api.internal.artifacts.ivyservice.ivyresolve.memcache.InMemoryCachedModuleComponentRepository$CachedAccess.resolveComponentMetaData(InMemoryCachedModuleComponentRepository.java:75)
	at org.gradle.api.internal.artifacts.ivyservice.ivyresolve.ErrorHandlingModuleComponentRepository$ErrorHandlingModuleComponentRepositoryAccess.resolveComponentMetaData(ErrorHandlingModuleComponentRepository.java:89)
	... 91 more
Caused by: org.gradle.api.UncheckedIOException: Could not GET 'http://maven.amadornes.com/MCMultiPart2/MCMultiPart/2.2.2/MCMultiPart-2.2.2.pom'. Received status code 403 from server: Forbidden
	at org.gradle.internal.resource.transport.http.HttpClientHelper.processResponse(HttpClientHelper.java:112)
	at org.gradle.internal.resource.transport.http.HttpClientHelper.performGet(HttpClientHelper.java:62)
	at org.gradle.internal.resource.transport.http.HttpResourceAccessor.openResource(HttpResourceAccessor.java:51)
	at org.gradle.internal.resource.transport.http.HttpResourceAccessor.openResource(HttpResourceAccessor.java:34)
	at org.gradle.internal.resource.transfer.DefaultExternalResourceConnector.openResource(DefaultExternalResourceConnector.java:56)
	at org.gradle.internal.resource.transfer.ProgressLoggingExternalResourceAccessor.openResource(ProgressLoggingExternalResourceAccessor.java:36)
	at org.gradle.internal.resource.transport.DefaultExternalResourceRepository.getResource(DefaultExternalResourceRepository.java:63)
	at org.gradle.internal.resource.transfer.DefaultCacheAwareExternalResourceAccessor.getResource(DefaultCacheAwareExternalResourceAccessor.java:76)
	at org.gradle.api.internal.artifacts.repositories.resolver.DefaultExternalResourceArtifactResolver.downloadStaticResource(DefaultExternalResourceArtifactResolver.java:86)
	... 108 more


BUILD FAILED

Total time: 29.812 secs
Build step 'Invoke Gradle script' changed build result to FAILURE
Build step 'Invoke Gradle script' marked build as failure
Archiving artifacts
Recording fingerprints
Collecting metadata...
Metadata collection done.
Started calculate disk usage of build
Finished Calculation of disk usage of build in 0 seconds
Started calculate disk usage of workspace
Finished Calculation of disk usage of workspace in 0 seconds
Finished: FAILURE